Page MenuHomePhabricator

0.9.5: test suite is failing
Open, NormalPublic

Description

+ /usr/bin/make -O -j48 V=1 VERBOSE=1 -C x86_64-redhat-linux-gnu test ARGS=--output-on-failure
make: Entering directory '/home/tkloczko/rpmbuild/BUILD/libssh-0.9.5/x86_64-redhat-linux-gnu'
Running tests...
/usr/bin/ctest --force-new-ctest-process --output-on-failure
Test project /home/tkloczko/rpmbuild/BUILD/libssh-0.9.5/x86_64-redhat-linux-gnu
      Start  1: torture_buffer
 1/57 Test  #1: torture_buffer ...................   Passed    0.21 sec
      Start  2: torture_bytearray
 2/57 Test  #2: torture_bytearray ................   Passed    0.00 sec
      Start  3: torture_callbacks
 3/57 Test  #3: torture_callbacks ................   Passed    0.00 sec
      Start  4: torture_crypto
 4/57 Test  #4: torture_crypto ...................   Passed    0.00 sec
      Start  5: torture_init
 5/57 Test  #5: torture_init .....................   Passed    0.00 sec
      Start  6: torture_list
 6/57 Test  #6: torture_list .....................   Passed    0.00 sec
      Start  7: torture_misc
 7/57 Test  #7: torture_misc .....................   Passed    0.11 sec
      Start  8: torture_config
 8/57 Test  #8: torture_config ...................   Passed    0.02 sec
      Start  9: torture_options
 9/57 Test  #9: torture_options ..................   Passed    0.01 sec
      Start 10: torture_isipaddr
10/57 Test #10: torture_isipaddr .................   Passed    0.00 sec
      Start 11: torture_knownhosts_parsing
11/57 Test #11: torture_knownhosts_parsing .......   Passed    0.00 sec
      Start 12: torture_hashes
12/57 Test #12: torture_hashes ...................   Passed    0.00 sec
      Start 13: torture_packet_filter
13/57 Test #13: torture_packet_filter ............   Passed    0.01 sec
      Start 14: torture_temp_dir
14/57 Test #14: torture_temp_dir .................   Passed    0.01 sec
      Start 15: torture_temp_file
15/57 Test #15: torture_temp_file ................   Passed    0.00 sec
      Start 16: torture_push_pop_dir
16/57 Test #16: torture_push_pop_dir .............   Passed    0.00 sec
      Start 17: torture_session_keys
17/57 Test #17: torture_session_keys .............   Passed    0.01 sec
      Start 18: torture_tokens
18/57 Test #18: torture_tokens ...................   Passed    0.01 sec
      Start 19: torture_packet
19/57 Test #19: torture_packet ...................   Passed    0.13 sec
      Start 20: torture_keyfiles
20/57 Test #20: torture_keyfiles .................   Passed    0.02 sec
      Start 21: torture_pki
21/57 Test #21: torture_pki ......................   Passed    2.30 sec
      Start 22: torture_pki_rsa
22/57 Test #22: torture_pki_rsa ..................   Passed    1.11 sec
      Start 23: torture_pki_ed25519
23/57 Test #23: torture_pki_ed25519 ..............   Passed    0.80 sec
      Start 24: torture_channel
24/57 Test #24: torture_channel ..................   Passed    0.00 sec
      Start 25: torture_bind_config
25/57 Test #25: torture_bind_config ..............   Passed    0.04 sec
      Start 26: torture_moduli
26/57 Test #26: torture_moduli ...................   Passed    0.00 sec
      Start 27: torture_pki_dsa
27/57 Test #27: torture_pki_dsa ..................   Passed    1.81 sec
      Start 28: torture_pki_ecdsa
28/57 Test #28: torture_pki_ecdsa ................   Passed    0.04 sec
      Start 29: torture_rand
29/57 Test #29: torture_rand .....................   Passed   10.51 sec
      Start 30: torture_threads_init
30/57 Test #30: torture_threads_init .............   Passed    0.00 sec
      Start 31: torture_threads_buffer
31/57 Test #31: torture_threads_buffer ...........   Passed    0.81 sec
      Start 32: torture_threads_crypto
32/57 Test #32: torture_threads_crypto ...........   Passed    0.02 sec
      Start 33: torture_threads_pki_rsa
33/57 Test #33: torture_threads_pki_rsa ..........   Passed    2.47 sec
      Start 34: torture_algorithms
34/57 Test #34: torture_algorithms ...............***Failed    0.14 sec
ERROR: ld.so: object 'lib64/libuid_wrapper.so' from LD_PRELOAD cannot be preloaded (cannot open shared object file): ignored.
[==========] Running 59 test(s).
ERROR: ld.so: object 'lib64/libuid_wrapper.so' from LD_PRELOAD cannot be preloaded (cannot open shared object file): ignored.
ERROR: ld.so: object 'lib64/libuid_wrapper.so' from LD_PRELOAD cannot be preloaded (cannot open shared object file): ignored.
ERROR: ld.so: object 'lib64/libuid_wrapper.so' from LD_PRELOAD cannot be preloaded (cannot open shared object file): ignored.
OK: SSH-2.0-OpenSSH_8.3
[ RUN      ] torture_algorithms_aes128_cbc_hmac_sha1
Could not run test: rc < 0, errno(1): Operation not permitted
[   LINE   ] --- /home/tkloczko/rpmbuild/BUILD/libssh-0.9.5/tests/client/torture_algorithms.c:59: error: Failure!Test setup failed
[  ERROR   ] torture_algorithms_aes128_cbc_hmac_sha1
[ RUN      ] torture_algorithms_aes128_cbc_hmac_sha2_256
Could not run test: rc < 0, errno(1): Operation not permitted
[   LINE   ] --- /home/tkloczko/rpmbuild/BUILD/libssh-0.9.5/tests/client/torture_algorithms.c:59: error: Failure!Test setup failed
[  ERROR   ] torture_algorithms_aes128_cbc_hmac_sha2_256
[ RUN      ] torture_algorithms_aes128_cbc_hmac_sha2_512
Could not run test: rc < 0, errno(1): Operation not permitted
[   LINE   ] --- /home/tkloczko/rpmbuild/BUILD/libssh-0.9.5/tests/client/torture_algorithms.c:59: error: Failure!Test setup failed
[  ERROR   ] torture_algorithms_aes128_cbc_hmac_sha2_512
[ RUN      ] torture_algorithms_aes128_cbc_hmac_sha1_etm
Could not run test: rc < 0, errno(1): Operation not permitted
[   LINE   ] --- /home/tkloczko/rpmbuild/BUILD/libssh-0.9.5/tests/client/torture_algorithms.c:59: error: Failure!Test setup failed
[  ERROR   ] torture_algorithms_aes128_cbc_hmac_sha1_etm
[ RUN      ] torture_algorithms_aes128_cbc_hmac_sha2_256_etm
Could not run test: rc < 0, errno(1): Operation not permitted
[   LINE   ] --- /home/tkloczko/rpmbuild/BUILD/libssh-0.9.5/tests/client/torture_algorithms.c:59: error: Failure!Test setup failed
[  ERROR   ] torture_algorithms_aes128_cbc_hmac_sha2_256_etm
[ RUN      ] torture_algorithms_aes128_cbc_hmac_sha2_512_etm
Could not run test: rc < 0, errno(1): Operation not permitted
[   LINE   ] --- /home/tkloczko/rpmbuild/BUILD/libssh-0.9.5/tests/client/torture_algorithms.c:59: error: Failure!Test setup failed
[  ERROR   ] torture_algorithms_aes128_cbc_hmac_sha2_512_etm
[ RUN      ] torture_algorithms_aes192_cbc_hmac_sha1
Could not run test: rc < 0, errno(1): Operation not permitted
[   LINE   ] --- /home/tkloczko/rpmbuild/BUILD/libssh-0.9.5/tests/client/torture_algorithms.c:59: error: Failure!Test setup failed
[  ERROR   ] torture_algorithms_aes192_cbc_hmac_sha1
[ RUN      ] torture_algorithms_aes192_cbc_hmac_sha2_256
Could not run test: rc < 0, errno(1): Operation not permitted
[   LINE   ] --- /home/tkloczko/rpmbuild/BUILD/libssh-0.9.5/tests/client/torture_algorithms.c:59: error: Failure!Test setup failed
[  ERROR   ] torture_algorithms_aes192_cbc_hmac_sha2_256
[ RUN      ] torture_algorithms_aes192_cbc_hmac_sha2_512
Could not run test: rc < 0, errno(1): Operation not permitted
[   LINE   ] --- /home/tkloczko/rpmbuild/BUILD/libssh-0.9.5/tests/client/torture_algorithms.c:59: error: Failure!Test setup failed
[  ERROR   ] torture_algorithms_aes192_cbc_hmac_sha2_512
[ RUN      ] torture_algorithms_aes192_cbc_hmac_sha1_etm
Could not run test: rc < 0, errno(1): Operation not permitted
[   LINE   ] --- /home/tkloczko/rpmbuild/BUILD/libssh-0.9.5/tests/client/torture_algorithms.c:59: error: Failure!Test setup failed
[  ERROR   ] torture_algorithms_aes192_cbc_hmac_sha1_etm
[ RUN      ] torture_algorithms_aes192_cbc_hmac_sha2_256_etm
Could not run test: rc < 0, errno(1): Operation not permitted
[   LINE   ] --- /home/tkloczko/rpmbuild/BUILD/libssh-0.9.5/tests/client/torture_algorithms.c:59: error: Failure!Test setup failed
[  ERROR   ] torture_algorithms_aes192_cbc_hmac_sha2_256_etm
[ RUN      ] torture_algorithms_aes192_cbc_hmac_sha2_512_etm
Could not run test: rc < 0, errno(1): Operation not permitted
[   LINE   ] --- /home/tkloczko/rpmbuild/BUILD/libssh-0.9.5/tests/client/torture_algorithms.c:59: error: Failure!Test setup failed
[  ERROR   ] torture_algorithms_aes192_cbc_hmac_sha2_512_etm
[ RUN      ] torture_algorithms_aes256_cbc_hmac_sha1
Could not run test: rc < 0, errno(1): Operation not permitted
[   LINE   ] --- /home/tkloczko/rpmbuild/BUILD/libssh-0.9.5/tests/client/torture_algorithms.c:59: error: Failure!Test setup failed
[  ERROR   ] torture_algorithms_aes256_cbc_hmac_sha1
[ RUN      ] torture_algorithms_aes256_cbc_hmac_sha2_256
Could not run test: rc < 0, errno(1): Operation not permitted
[   LINE   ] --- /home/tkloczko/rpmbuild/BUILD/libssh-0.9.5/tests/client/torture_algorithms.c:59: error: Failure!Test setup failed
[  ERROR   ] torture_algorithms_aes256_cbc_hmac_sha2_256
[ RUN      ] torture_algorithms_aes256_cbc_hmac_sha2_512
Could not run test: rc < 0, errno(1): Operation not permitted
[   LINE   ] --- /home/tkloczko/rpmbuild/BUILD/libssh-0.9.5/tests/client/torture_algorithms.c:59: error: Failure!Test setup failed
[  ERROR   ] torture_algorithms_aes256_cbc_hmac_sha2_512
[ RUN      ] torture_algorithms_aes256_cbc_hmac_sha1_etm
Could not run test: rc < 0, errno(1): Operation not permitted
[   LINE   ] --- /home/tkloczko/rpmbuild/BUILD/libssh-0.9.5/tests/client/torture_algorithms.c:59: error: Failure!Test setup failed
[  ERROR   ] torture_algorithms_aes256_cbc_hmac_sha1_etm
[ RUN      ] torture_algorithms_aes256_cbc_hmac_sha2_256_etm
Could not run test: rc < 0, errno(1): Operation not permitted
[   LINE   ] --- /home/tkloczko/rpmbuild/BUILD/libssh-0.9.5/tests/client/torture_algorithms.c:59: error: Failure!Test setup failed
[  ERROR   ] torture_algorithms_aes256_cbc_hmac_sha2_256_etm
[ RUN      ] torture_algorithms_aes256_cbc_hmac_sha2_512_etm
Could not run test: rc < 0, errno(1): Operation not permitted
[   LINE   ] --- /home/tkloczko/rpmbuild/BUILD/libssh-0.9.5/tests/client/torture_algorithms.c:59: error: Failure!Test setup failed
[  ERROR   ] torture_algorithms_aes256_cbc_hmac_sha2_512_etm
[ RUN      ] torture_algorithms_aes128_ctr_hmac_sha1
Could not run test: rc < 0, errno(1): Operation not permitted
[   LINE   ] --- /home/tkloczko/rpmbuild/BUILD/libssh-0.9.5/tests/client/torture_algorithms.c:59: error: Failure!Test setup failed
[  ERROR   ] torture_algorithms_aes128_ctr_hmac_sha1
[ RUN      ] torture_algorithms_aes128_ctr_hmac_sha2_256
Could not run test: rc < 0, errno(1): Operation not permitted
[   LINE   ] --- /home/tkloczko/rpmbuild/BUILD/libssh-0.9.5/tests/client/torture_algorithms.c:59: error: Failure!Test setup failed
[  ERROR   ] torture_algorithms_aes128_ctr_hmac_sha2_256
[ RUN      ] torture_algorithms_aes128_ctr_hmac_sha2_512
Could not run test: rc < 0, errno(1): Operation not permitted
[   LINE   ] --- /home/tkloczko/rpmbuild/BUILD/libssh-0.9.5/tests/client/torture_algorithms.c:59: error: Failure!Test setup failed
[  ERROR   ] torture_algorithms_aes128_ctr_hmac_sha2_512
[ RUN      ] torture_algorithms_aes128_ctr_hmac_sha1_etm
Could not run test: rc < 0, errno(1): Operation not permitted
[   LINE   ] --- /home/tkloczko/rpmbuild/BUILD/libssh-0.9.5/tests/client/torture_algorithms.c:59: error: Failure!Test setup failed
[  ERROR   ] torture_algorithms_aes128_ctr_hmac_sha1_etm
[ RUN      ] torture_algorithms_aes128_ctr_hmac_sha2_256_etm
Could not run test: rc < 0, errno(1): Operation not permitted
[   LINE   ] --- /home/tkloczko/rpmbuild/BUILD/libssh-0.9.5/tests/client/torture_algorithms.c:59: error: Failure!Test setup failed
[  ERROR   ] torture_algorithms_aes128_ctr_hmac_sha2_256_etm
[ RUN      ] torture_algorithms_aes128_ctr_hmac_sha2_512_etm
Could not run test: rc < 0, errno(1): Operation not permitted
[   LINE   ] --- /home/tkloczko/rpmbuild/BUILD/libssh-0.9.5/tests/client/torture_algorithms.c:59: error: Failure!Test setup failed
[  ERROR   ] torture_algorithms_aes128_ctr_hmac_sha2_512_etm
[ RUN      ] torture_algorithms_aes192_ctr_hmac_sha1
Could not run test: rc < 0, errno(1): Operation not permitted
[   LINE   ] --- /home/tkloczko/rpmbuild/BUILD/libssh-0.9.5/tests/client/torture_algorithms.c:59: error: Failure!Test setup failed
[  ERROR   ] torture_algorithms_aes192_ctr_hmac_sha1
[ RUN      ] torture_algorithms_aes192_ctr_hmac_sha2_256
Could not run test: rc < 0, errno(1): Operation not permitted
[   LINE   ] --- /home/tkloczko/rpmbuild/BUILD/libssh-0.9.5/tests/client/torture_algorithms.c:59: error: Failure!Test setup failed
[  ERROR   ] torture_algorithms_aes192_ctr_hmac_sha2_256
[ RUN      ] torture_algorithms_aes192_ctr_hmac_sha2_512
Could not run test: rc < 0, errno(1): Operation not permitted
[   LINE   ] --- /home/tkloczko/rpmbuild/BUILD/libssh-0.9.5/tests/client/torture_algorithms.c:59: error: Failure!Test setup failed
[  ERROR   ] torture_algorithms_aes192_ctr_hmac_sha2_512
[ RUN      ] torture_algorithms_aes192_ctr_hmac_sha1_etm
Could not run test: rc < 0, errno(1): Operation not permitted
[   LINE   ] --- /home/tkloczko/rpmbuild/BUILD/libssh-0.9.5/tests/client/torture_algorithms.c:59: error: Failure!Test setup failed
[  ERROR   ] torture_algorithms_aes192_ctr_hmac_sha1_etm
[ RUN      ] torture_algorithms_aes192_ctr_hmac_sha2_256_etm
Could not run test: rc < 0, errno(1): Operation not permitted
[   LINE   ] --- /home/tkloczko/rpmbuild/BUILD/libssh-0.9.5/tests/client/torture_algorithms.c:59: error: Failure!Test setup failed
[  ERROR   ] torture_algorithms_aes192_ctr_hmac_sha2_256_etm
[ RUN      ] torture_algorithms_aes192_ctr_hmac_sha2_512_etm
Could not run test: rc < 0, errno(1): Operation not permitted
[   LINE   ] --- /home/tkloczko/rpmbuild/BUILD/libssh-0.9.5/tests/client/torture_algorithms.c:59: error: Failure!Test setup failed
[  ERROR   ] torture_algorithms_aes192_ctr_hmac_sha2_512_etm
[ RUN      ] torture_algorithms_aes256_ctr_hmac_sha1
Could not run test: rc < 0, errno(1): Operation not permitted
[   LINE   ] --- /home/tkloczko/rpmbuild/BUILD/libssh-0.9.5/tests/client/torture_algorithms.c:59: error: Failure!Test setup failed
[  ERROR   ] torture_algorithms_aes256_ctr_hmac_sha1
[ RUN      ] torture_algorithms_aes256_ctr_hmac_sha2_256
Could not run test: rc < 0, errno(1): Operation not permitted
[   LINE   ] --- /home/tkloczko/rpmbuild/BUILD/libssh-0.9.5/tests/client/torture_algorithms.c:59: error: Failure!Test setup failed
[  ERROR   ] torture_algorithms_aes256_ctr_hmac_sha2_256
[ RUN      ] torture_algorithms_aes256_ctr_hmac_sha2_512
Could not run test: rc < 0, errno(1): Operation not permitted
[   LINE   ] --- /home/tkloczko/rpmbuild/BUILD/libssh-0.9.5/tests/client/torture_algorithms.c:59: error: Failure!Test setup failed
[  ERROR   ] torture_algorithms_aes256_ctr_hmac_sha2_512
[ RUN      ] torture_algorithms_aes256_ctr_hmac_sha1_etm
Could not run test: rc < 0, errno(1): Operation not permitted
[   LINE   ] --- /home/tkloczko/rpmbuild/BUILD/libssh-0.9.5/tests/client/torture_algorithms.c:59: error: Failure!Test setup failed
[  ERROR   ] torture_algorithms_aes256_ctr_hmac_sha1_etm
[ RUN      ] torture_algorithms_aes256_ctr_hmac_sha2_256_etm
Could not run test: rc < 0, errno(1): Operation not permitted
[   LINE   ] --- /home/tkloczko/rpmbuild/BUILD/libssh-0.9.5/tests/client/torture_algorithms.c:59: error: Failure!Test setup failed
[  ERROR   ] torture_algorithms_aes256_ctr_hmac_sha2_256_etm
[ RUN      ] torture_algorithms_aes256_ctr_hmac_sha2_512_etm
Could not run test: rc < 0, errno(1): Operation not permitted
[   LINE   ] --- /home/tkloczko/rpmbuild/BUILD/libssh-0.9.5/tests/client/torture_algorithms.c:59: error: Failure!Test setup failed
[  ERROR   ] torture_algorithms_aes256_ctr_hmac_sha2_512_etm
[ RUN      ] torture_algorithms_aes128_gcm
Could not run test: rc < 0, errno(1): Operation not permitted
[   LINE   ] --- /home/tkloczko/rpmbuild/BUILD/libssh-0.9.5/tests/client/torture_algorithms.c:59: error: Failure!Test setup failed
[  ERROR   ] torture_algorithms_aes128_gcm
[ RUN      ] torture_algorithms_aes256_gcm
Could not run test: rc < 0, errno(1): Operation not permitted
[   LINE   ] --- /home/tkloczko/rpmbuild/BUILD/libssh-0.9.5/tests/client/torture_algorithms.c:59: error: Failure!Test setup failed
[  ERROR   ] torture_algorithms_aes256_gcm
[ RUN      ] torture_algorithms_3des_cbc_hmac_sha1
Could not run test: rc < 0, errno(1): Operation not permitted
[   LINE   ] --- /home/tkloczko/rpmbuild/BUILD/libssh-0.9.5/tests/client/torture_algorithms.c:59: error: Failure!Test setup failed
[  ERROR   ] torture_algorithms_3des_cbc_hmac_sha1
[ RUN      ] torture_algorithms_3des_cbc_hmac_sha2_256
Could not run test: rc < 0, errno(1): Operation not permitted
[   LINE   ] --- /home/tkloczko/rpmbuild/BUILD/libssh-0.9.5/tests/client/torture_algorithms.c:59: error: Failure!Test setup failed
[  ERROR   ] torture_algorithms_3des_cbc_hmac_sha2_256
[ RUN      ] torture_algorithms_3des_cbc_hmac_sha2_512
Could not run test: rc < 0, errno(1): Operation not permitted
[   LINE   ] --- /home/tkloczko/rpmbuild/BUILD/libssh-0.9.5/tests/client/torture_algorithms.c:59: error: Failure!Test setup failed
[  ERROR   ] torture_algorithms_3des_cbc_hmac_sha2_512
[ RUN      ] torture_algorithms_3des_cbc_hmac_sha1_etm
Could not run test: rc < 0, errno(1): Operation not permitted
[   LINE   ] --- /home/tkloczko/rpmbuild/BUILD/libssh-0.9.5/tests/client/torture_algorithms.c:59: error: Failure!Test setup failed
[  ERROR   ] torture_algorithms_3des_cbc_hmac_sha1_etm
[ RUN      ] torture_algorithms_3des_cbc_hmac_sha2_256_etm
Could not run test: rc < 0, errno(1): Operation not permitted
[   LINE   ] --- /home/tkloczko/rpmbuild/BUILD/libssh-0.9.5/tests/client/torture_algorithms.c:59: error: Failure!Test setup failed
[  ERROR   ] torture_algorithms_3des_cbc_hmac_sha2_256_etm
[ RUN      ] torture_algorithms_3des_cbc_hmac_sha2_512_etm
Could not run test: rc < 0, errno(1): Operation not permitted
[   LINE   ] --- /home/tkloczko/rpmbuild/BUILD/libssh-0.9.5/tests/client/torture_algorithms.c:59: error: Failure!Test setup failed
[  ERROR   ] torture_algorithms_3des_cbc_hmac_sha2_512_etm
[ RUN      ] torture_algorithms_chacha20_poly1305
Could not run test: rc < 0, errno(1): Operation not permitted
[   LINE   ] --- /home/tkloczko/rpmbuild/BUILD/libssh-0.9.5/tests/client/torture_algorithms.c:59: error: Failure!Test setup failed
[  ERROR   ] torture_algorithms_chacha20_poly1305
[ RUN      ] torture_algorithms_zlib
Could not run test: rc < 0, errno(1): Operation not permitted
[   LINE   ] --- /home/tkloczko/rpmbuild/BUILD/libssh-0.9.5/tests/client/torture_algorithms.c:59: error: Failure!Test setup failed
[  ERROR   ] torture_algorithms_zlib
[ RUN      ] torture_algorithms_zlib_openssh
Could not run test: rc < 0, errno(1): Operation not permitted
[   LINE   ] --- /home/tkloczko/rpmbuild/BUILD/libssh-0.9.5/tests/client/torture_algorithms.c:59: error: Failure!Test setup failed
[  ERROR   ] torture_algorithms_zlib_openssh
[ RUN      ] torture_algorithms_dh_group1
Could not run test: rc < 0, errno(1): Operation not permitted
[   LINE   ] --- /home/tkloczko/rpmbuild/BUILD/libssh-0.9.5/tests/client/torture_algorithms.c:59: error: Failure!Test setup failed
[  ERROR   ] torture_algorithms_dh_group1
[ RUN      ] torture_algorithms_dh_group14
Could not run test: rc < 0, errno(1): Operation not permitted
[   LINE   ] --- /home/tkloczko/rpmbuild/BUILD/libssh-0.9.5/tests/client/torture_algorithms.c:59: error: Failure!Test setup failed
[  ERROR   ] torture_algorithms_dh_group14
[ RUN      ] torture_algorithms_dh_group14_sha256
Could not run test: rc < 0, errno(1): Operation not permitted
[   LINE   ] --- /home/tkloczko/rpmbuild/BUILD/libssh-0.9.5/tests/client/torture_algorithms.c:59: error: Failure!Test setup failed
[  ERROR   ] torture_algorithms_dh_group14_sha256
[ RUN      ] torture_algorithms_dh_group16
Could not run test: rc < 0, errno(1): Operation not permitted
[   LINE   ] --- /home/tkloczko/rpmbuild/BUILD/libssh-0.9.5/tests/client/torture_algorithms.c:59: error: Failure!Test setup failed
[  ERROR   ] torture_algorithms_dh_group16
[ RUN      ] torture_algorithms_dh_group18
Could not run test: rc < 0, errno(1): Operation not permitted
[   LINE   ] --- /home/tkloczko/rpmbuild/BUILD/libssh-0.9.5/tests/client/torture_algorithms.c:59: error: Failure!Test setup failed
[  ERROR   ] torture_algorithms_dh_group18
[ RUN      ] torture_algorithms_dh_gex_sha1
Could not run test: rc < 0, errno(1): Operation not permitted
[   LINE   ] --- /home/tkloczko/rpmbuild/BUILD/libssh-0.9.5/tests/client/torture_algorithms.c:59: error: Failure!Test setup failed
[  ERROR   ] torture_algorithms_dh_gex_sha1
[ RUN      ] torture_algorithms_dh_gex_sha256
Could not run test: rc < 0, errno(1): Operation not permitted
[   LINE   ] --- /home/tkloczko/rpmbuild/BUILD/libssh-0.9.5/tests/client/torture_algorithms.c:59: error: Failure!Test setup failed
[  ERROR   ] torture_algorithms_dh_gex_sha256
[ RUN      ] torture_algorithms_ecdh_curve25519_sha256
Could not run test: rc < 0, errno(1): Operation not permitted
[   LINE   ] --- /home/tkloczko/rpmbuild/BUILD/libssh-0.9.5/tests/client/torture_algorithms.c:59: error: Failure!Test setup failed
[  ERROR   ] torture_algorithms_ecdh_curve25519_sha256
[ RUN      ] torture_algorithms_ecdh_curve25519_sha256_libssh_org
Could not run test: rc < 0, errno(1): Operation not permitted
[   LINE   ] --- /home/tkloczko/rpmbuild/BUILD/libssh-0.9.5/tests/client/torture_algorithms.c:59: error: Failure!Test setup failed
[  ERROR   ] torture_algorithms_ecdh_curve25519_sha256_libssh_org
[ RUN      ] torture_algorithms_ecdh_sha2_nistp256
Could not run test: rc < 0, errno(1): Operation not permitted
[   LINE   ] --- /home/tkloczko/rpmbuild/BUILD/libssh-0.9.5/tests/client/torture_algorithms.c:59: error: Failure!Test setup failed
[  ERROR   ] torture_algorithms_ecdh_sha2_nistp256
[ RUN      ] torture_algorithms_ecdh_sha2_nistp384
Could not run test: rc < 0, errno(1): Operation not permitted
[   LINE   ] --- /home/tkloczko/rpmbuild/BUILD/libssh-0.9.5/tests/client/torture_algorithms.c:59: error: Failure!Test setup failed
[  ERROR   ] torture_algorithms_ecdh_sha2_nistp384
[ RUN      ] torture_algorithms_ecdh_sha2_nistp521
Could not run test: rc < 0, errno(1): Operation not permitted
[   LINE   ] --- /home/tkloczko/rpmbuild/BUILD/libssh-0.9.5/tests/client/torture_algorithms.c:59: error: Failure!Test setup failed
[  ERROR   ] torture_algorithms_ecdh_sha2_nistp521
[==========] 59 test(s) run.
[  PASSED  ] 0 test(s).

      Start 35: torture_client_config
35/57 Test #35: torture_client_config ............***Failed    0.12 sec
ERROR: ld.so: object 'lib64/libuid_wrapper.so' from LD_PRELOAD cannot be preloaded (cannot open shared object file): ignored.
[==========] Running 4 test(s).
ERROR: ld.so: object 'lib64/libuid_wrapper.so' from LD_PRELOAD cannot be preloaded (cannot open shared object file): ignored.
ERROR: ld.so: object 'lib64/libuid_wrapper.so' from LD_PRELOAD cannot be preloaded (cannot open shared object file): ignored.
ERROR: ld.so: object 'lib64/libuid_wrapper.so' from LD_PRELOAD cannot be preloaded (cannot open shared object file): ignored.
OK: SSH-2.0-OpenSSH_8.3
[ RUN      ] torture_client_config_system
Could not run test: rc < 0, errno(1): Operation not permitted
[   LINE   ] --- /home/tkloczko/rpmbuild/BUILD/libssh-0.9.5/tests/client/torture_client_config.c:44: error: Failure!Test setup failed
[  ERROR   ] torture_client_config_system
[ RUN      ] torture_client_config_emulate
Could not run test: rc < 0, errno(1): Operation not permitted
[   LINE   ] --- /home/tkloczko/rpmbuild/BUILD/libssh-0.9.5/tests/client/torture_client_config.c:44: error: Failure!Test setup failed
[  ERROR   ] torture_client_config_emulate
[ RUN      ] torture_client_config_autoparse
Could not run test: rc < 0, errno(1): Operation not permitted
[   LINE   ] --- /home/tkloczko/rpmbuild/BUILD/libssh-0.9.5/tests/client/torture_client_config.c:44: error: Failure!Test setup failed
[  ERROR   ] torture_client_config_autoparse
[ RUN      ] torture_client_config_suppress
Could not run test: rc < 0, errno(1): Operation not permitted
[   LINE   ] --- /home/tkloczko/rpmbuild/BUILD/libssh-0.9.5/tests/client/torture_client_config.c:44: error: Failure!Test setup failed
[  ERROR   ] torture_client_config_suppress
[==========] 4 test(s) run.
[  PASSED  ] 0 test(s).

      Start 36: torture_connect
36/57 Test #36: torture_connect ..................***Failed    0.13 sec
ERROR: ld.so: object 'lib64/libuid_wrapper.so' from LD_PRELOAD cannot be preloaded (cannot open shared object file): ignored.
[==========] Running 5 test(s).
ERROR: ld.so: object 'lib64/libuid_wrapper.so' from LD_PRELOAD cannot be preloaded (cannot open shared object file): ignored.
ERROR: ld.so: object 'lib64/libuid_wrapper.so' from LD_PRELOAD cannot be preloaded (cannot open shared object file): ignored.
ERROR: ld.so: object 'lib64/libuid_wrapper.so' from LD_PRELOAD cannot be preloaded (cannot open shared object file): ignored.
OK: SSH-2.0-OpenSSH_8.3
[ RUN      ] torture_connect_nonblocking
Could not run test: rc < 0, errno(1): Operation not permitted
[   LINE   ] --- /home/tkloczko/rpmbuild/BUILD/libssh-0.9.5/tests/client/torture_connect.c:65: error: Failure!Test setup failed
[  ERROR   ] torture_connect_nonblocking
[ RUN      ] torture_connect_double
Could not run test: rc < 0, errno(1): Operation not permitted
[   LINE   ] --- /home/tkloczko/rpmbuild/BUILD/libssh-0.9.5/tests/client/torture_connect.c:65: error: Failure!Test setup failed
[  ERROR   ] torture_connect_double
[ RUN      ] torture_connect_failure
Could not run test: rc < 0, errno(1): Operation not permitted
[   LINE   ] --- /home/tkloczko/rpmbuild/BUILD/libssh-0.9.5/tests/client/torture_connect.c:65: error: Failure!Test setup failed
[  ERROR   ] torture_connect_failure
[ RUN      ] torture_connect_socket
Could not run test: rc < 0, errno(1): Operation not permitted
[   LINE   ] --- /home/tkloczko/rpmbuild/BUILD/libssh-0.9.5/tests/client/torture_connect.c:65: error: Failure!Test setup failed
[  ERROR   ] torture_connect_socket
[ RUN      ] torture_connect_uninitialized
[  ERROR   ] --- rc < 0, errno(1): Operation not permitted
[   LINE   ] --- /home/tkloczko/rpmbuild/BUILD/libssh-0.9.5/tests/client/torture_connect.c:202: error: Failure!
[  FAILED  ] torture_connect_uninitialized
[==========] 5 test(s) run.
[  PASSED  ] 0 test(s).
[  FAILED  ] 1 test(s), listed below:
[  FAILED  ] torture_connect_uninitialized

 5 FAILED TEST(S)

      Start 37: torture_hostkey
37/57 Test #37: torture_hostkey ..................***Failed    0.13 sec
ERROR: ld.so: object 'lib64/libuid_wrapper.so' from LD_PRELOAD cannot be preloaded (cannot open shared object file): ignored.
[==========] Running 6 test(s).
ERROR: ld.so: object 'lib64/libuid_wrapper.so' from LD_PRELOAD cannot be preloaded (cannot open shared object file): ignored.
PWRAP_ERROR[<unknown> (87813)] - pwrap_clean_stale_dirs: Failed to parse pid, buf=79413
ERROR: ld.so: object 'lib64/libuid_wrapper.so' from LD_PRELOAD cannot be preloaded (cannot open shared object file): ignored.
ERROR: ld.so: object 'lib64/libuid_wrapper.so' from LD_PRELOAD cannot be preloaded (cannot open shared object file): ignored.
OK: SSH-2.0-OpenSSH_8.3
[ RUN      ] torture_hostkey_rsa
Could not run test: rc < 0, errno(1): Operation not permitted
[   LINE   ] --- /home/tkloczko/rpmbuild/BUILD/libssh-0.9.5/tests/client/torture_hostkey.c:60: error: Failure!Test setup failed
[  ERROR   ] torture_hostkey_rsa
[ RUN      ] torture_hostkey_ed25519
Could not run test: rc < 0, errno(1): Operation not permitted
[   LINE   ] --- /home/tkloczko/rpmbuild/BUILD/libssh-0.9.5/tests/client/torture_hostkey.c:60: error: Failure!Test setup failed
[  ERROR   ] torture_hostkey_ed25519
[ RUN      ] torture_hostkey_ecdsa
Could not run test: rc < 0, errno(1): Operation not permitted
[   LINE   ] --- /home/tkloczko/rpmbuild/BUILD/libssh-0.9.5/tests/client/torture_hostkey.c:60: error: Failure!Test setup failed
[  ERROR   ] torture_hostkey_ecdsa
[ RUN      ] torture_hostkey_dss
Could not run test: rc < 0, errno(1): Operation not permitted
[   LINE   ] --- /home/tkloczko/rpmbuild/BUILD/libssh-0.9.5/tests/client/torture_hostkey.c:60: error: Failure!Test setup failed
[  ERROR   ] torture_hostkey_dss
[ RUN      ] torture_hostkey_rsa_sha256
Could not run test: rc < 0, errno(1): Operation not permitted
[   LINE   ] --- /home/tkloczko/rpmbuild/BUILD/libssh-0.9.5/tests/client/torture_hostkey.c:60: error: Failure!Test setup failed
[  ERROR   ] torture_hostkey_rsa_sha256
[ RUN      ] torture_hostkey_rsa_sha512
Could not run test: rc < 0, errno(1): Operation not permitted
[   LINE   ] --- /home/tkloczko/rpmbuild/BUILD/libssh-0.9.5/tests/client/torture_hostkey.c:60: error: Failure!Test setup failed
[  ERROR   ] torture_hostkey_rsa_sha512
[==========] 6 test(s) run.
[  PASSED  ] 0 test(s).

      Start 38: torture_auth
38/57 Test #38: torture_auth .....................***Failed    0.13 sec
ERROR: ld.so: object 'lib64/libuid_wrapper.so' from LD_PRELOAD cannot be preloaded (cannot open shared object file): ignored.
[==========] Running 19 test(s).
ERROR: ld.so: object 'lib64/libuid_wrapper.so' from LD_PRELOAD cannot be preloaded (cannot open shared object file): ignored.
ERROR: ld.so: object 'lib64/libuid_wrapper.so' from LD_PRELOAD cannot be preloaded (cannot open shared object file): ignored.
ERROR: ld.so: object 'lib64/libuid_wrapper.so' from LD_PRELOAD cannot be preloaded (cannot open shared object file): ignored.
OK: SSH-2.0-OpenSSH_8.3
[ RUN      ] torture_auth_none
Could not run test: rc < 0, errno(1): Operation not permitted
[   LINE   ] --- /home/tkloczko/rpmbuild/BUILD/libssh-0.9.5/tests/client/torture_auth.c:64: error: Failure!Test setup failed
[  ERROR   ] torture_auth_none
[ RUN      ] torture_auth_none_nonblocking
Could not run test: rc < 0, errno(1): Operation not permitted
[   LINE   ] --- /home/tkloczko/rpmbuild/BUILD/libssh-0.9.5/tests/client/torture_auth.c:64: error: Failure!Test setup failed
[  ERROR   ] torture_auth_none_nonblocking
[ RUN      ] torture_auth_password
Could not run test: rc < 0, errno(1): Operation not permitted
[   LINE   ] --- /home/tkloczko/rpmbuild/BUILD/libssh-0.9.5/tests/client/torture_auth.c:64: error: Failure!Test setup failed
[  ERROR   ] torture_auth_password
[ RUN      ] torture_auth_password_nonblocking
Could not run test: rc < 0, errno(1): Operation not permitted
[   LINE   ] --- /home/tkloczko/rpmbuild/BUILD/libssh-0.9.5/tests/client/torture_auth.c:64: error: Failure!Test setup failed
[  ERROR   ] torture_auth_password_nonblocking
[ RUN      ] torture_auth_kbdint
Could not run test: rc < 0, errno(1): Operation not permitted
[   LINE   ] --- /home/tkloczko/rpmbuild/BUILD/libssh-0.9.5/tests/client/torture_auth.c:64: error: Failure!Test setup failed
[  ERROR   ] torture_auth_kbdint
[ RUN      ] torture_auth_kbdint_nonblocking
Could not run test: rc < 0, errno(1): Operation not permitted
[   LINE   ] --- /home/tkloczko/rpmbuild/BUILD/libssh-0.9.5/tests/client/torture_auth.c:64: error: Failure!Test setup failed
[  ERROR   ] torture_auth_kbdint_nonblocking
[ RUN      ] torture_auth_autopubkey
Could not run test: rc < 0, errno(1): Operation not permitted
[   LINE   ] --- /home/tkloczko/rpmbuild/BUILD/libssh-0.9.5/tests/client/torture_auth.c:64: error: Failure!Test setup failed
[  ERROR   ] torture_auth_autopubkey
[ RUN      ] torture_auth_autopubkey_nonblocking
Could not run test: rc < 0, errno(1): Operation not permitted
[   LINE   ] --- /home/tkloczko/rpmbuild/BUILD/libssh-0.9.5/tests/client/torture_auth.c:64: error: Failure!Test setup failed
[  ERROR   ] torture_auth_autopubkey_nonblocking
[ RUN      ] torture_auth_agent
Could not run test: rc < 0, errno(1): Operation not permitted
[   LINE   ] --- /home/tkloczko/rpmbuild/BUILD/libssh-0.9.5/tests/client/torture_auth.c:64: error: Failure!Test setup failed
[  ERROR   ] torture_auth_agent
[ RUN      ] torture_auth_agent_nonblocking
Could not run test: rc < 0, errno(1): Operation not permitted
[   LINE   ] --- /home/tkloczko/rpmbuild/BUILD/libssh-0.9.5/tests/client/torture_auth.c:64: error: Failure!Test setup failed
[  ERROR   ] torture_auth_agent_nonblocking
[ RUN      ] torture_auth_cert
Could not run test: rc < 0, errno(1): Operation not permitted
[   LINE   ] --- /home/tkloczko/rpmbuild/BUILD/libssh-0.9.5/tests/client/torture_auth.c:64: error: Failure!Test setup failed
[  ERROR   ] torture_auth_cert
[ RUN      ] torture_auth_agent_cert
Could not run test: rc < 0, errno(1): Operation not permitted
[   LINE   ] --- /home/tkloczko/rpmbuild/BUILD/libssh-0.9.5/tests/client/torture_auth.c:64: error: Failure!Test setup failed
[  ERROR   ] torture_auth_agent_cert
[ RUN      ] torture_auth_agent_cert_nonblocking
Could not run test: rc < 0, errno(1): Operation not permitted
[   LINE   ] --- /home/tkloczko/rpmbuild/BUILD/libssh-0.9.5/tests/client/torture_auth.c:64: error: Failure!Test setup failed
[  ERROR   ] torture_auth_agent_cert_nonblocking
[ RUN      ] torture_auth_pubkey_types
Could not run test: rc < 0, errno(1): Operation not permitted
[   LINE   ] --- /home/tkloczko/rpmbuild/BUILD/libssh-0.9.5/tests/client/torture_auth.c:64: error: Failure!Test setup failed
[  ERROR   ] torture_auth_pubkey_types
[ RUN      ] torture_auth_pubkey_types_nonblocking
Could not run test: rc < 0, errno(1): Operation not permitted
[   LINE   ] --- /home/tkloczko/rpmbuild/BUILD/libssh-0.9.5/tests/client/torture_auth.c:64: error: Failure!Test setup failed
[  ERROR   ] torture_auth_pubkey_types_nonblocking
[ RUN      ] torture_auth_pubkey_types_ecdsa
Could not run test: rc < 0, errno(1): Operation not permitted
[   LINE   ] --- /home/tkloczko/rpmbuild/BUILD/libssh-0.9.5/tests/client/torture_auth.c:64: error: Failure!Test setup failed
[  ERROR   ] torture_auth_pubkey_types_ecdsa
[ RUN      ] torture_auth_pubkey_types_ecdsa_nonblocking
Could not run test: rc < 0, errno(1): Operation not permitted
[   LINE   ] --- /home/tkloczko/rpmbuild/BUILD/libssh-0.9.5/tests/client/torture_auth.c:64: error: Failure!Test setup failed
[  ERROR   ] torture_auth_pubkey_types_ecdsa_nonblocking
[ RUN      ] torture_auth_pubkey_types_ed25519
Could not run test: rc < 0, errno(1): Operation not permitted
[   LINE   ] --- /home/tkloczko/rpmbuild/BUILD/libssh-0.9.5/tests/client/torture_auth.c:64: error: Failure!Test setup failed
[  ERROR   ] torture_auth_pubkey_types_ed25519
[ RUN      ] torture_auth_pubkey_types_ed25519_nonblocking
Could not run test: rc < 0, errno(1): Operation not permitted
[   LINE   ] --- /home/tkloczko/rpmbuild/BUILD/libssh-0.9.5/tests/client/torture_auth.c:64: error: Failure!Test setup failed
[  ERROR   ] torture_auth_pubkey_types_ed25519_nonblocking
[==========] 19 test(s) run.
[  PASSED  ] 0 test(s).

      Start 39: torture_rekey
39/57 Test #39: torture_rekey ....................***Failed    0.12 sec
ERROR: ld.so: object 'lib64/libuid_wrapper.so' from LD_PRELOAD cannot be preloaded (cannot open shared object file): ignored.
[==========] Running 6 test(s).
ERROR: ld.so: object 'lib64/libuid_wrapper.so' from LD_PRELOAD cannot be preloaded (cannot open shared object file): ignored.
PWRAP_ERROR[<unknown> (87863)] - pwrap_clean_stale_dirs: Failed to parse pid, buf=79390
PWRAP_ERROR[<unknown> (87863)] - pwrap_clean_stale_dirs: Failed to parse pid, buf=79325
ERROR: ld.so: object 'lib64/libuid_wrapper.so' from LD_PRELOAD cannot be preloaded (cannot open shared object file): ignored.
ERROR: ld.so: object 'lib64/libuid_wrapper.so' from LD_PRELOAD cannot be preloaded (cannot open shared object file): ignored.
OK: SSH-2.0-OpenSSH_8.3
[ RUN      ] torture_rekey_default
Could not run test: rc < 0, errno(1): Operation not permitted
[   LINE   ] --- /home/tkloczko/rpmbuild/BUILD/libssh-0.9.5/tests/client/torture_rekey.c:67: error: Failure!Test setup failed
[  ERROR   ] torture_rekey_default
[ RUN      ] torture_rekey_time
Could not run test: rc < 0, errno(1): Operation not permitted
[   LINE   ] --- /home/tkloczko/rpmbuild/BUILD/libssh-0.9.5/tests/client/torture_rekey.c:67: error: Failure!Test setup failed
[  ERROR   ] torture_rekey_time
[ RUN      ] torture_rekey_recv
Could not run test: rc < 0, errno(1): Operation not permitted
[   LINE   ] --- /home/tkloczko/rpmbuild/BUILD/libssh-0.9.5/tests/client/torture_rekey.c:67: error: Failure!Test setup failed
[  ERROR   ] torture_rekey_recv
[ RUN      ] torture_rekey_send
Could not run test: rc < 0, errno(1): Operation not permitted
[   LINE   ] --- /home/tkloczko/rpmbuild/BUILD/libssh-0.9.5/tests/client/torture_rekey.c:67: error: Failure!Test setup failed
[  ERROR   ] torture_rekey_send
[ RUN      ] torture_rekey_server_send
Could not run test: rc < 0, errno(1): Operation not permitted
[   LINE   ] --- /home/tkloczko/rpmbuild/BUILD/libssh-0.9.5/tests/client/torture_rekey.c:67: error: Failure!Test setup failed
[  ERROR   ] torture_rekey_server_send
[ RUN      ] torture_rekey_server_recv
Could not run test: rc < 0, errno(1): Operation not permitted
[   LINE   ] --- /home/tkloczko/rpmbuild/BUILD/libssh-0.9.5/tests/client/torture_rekey.c:67: error: Failure!Test setup failed
[  ERROR   ] torture_rekey_server_recv
[==========] 6 test(s) run.
[  PASSED  ] 0 test(s).

      Start 40: torture_forward
40/57 Test #40: torture_forward ..................***Failed    0.12 sec
ERROR: ld.so: object 'lib64/libuid_wrapper.so' from LD_PRELOAD cannot be preloaded (cannot open shared object file): ignored.
[==========] Running 1 test(s).
ERROR: ld.so: object 'lib64/libuid_wrapper.so' from LD_PRELOAD cannot be preloaded (cannot open shared object file): ignored.
PWRAP_ERROR[<unknown> (87870)] - pwrap_clean_stale_dirs: Failed to parse pid, buf=79325
ERROR: ld.so: object 'lib64/libuid_wrapper.so' from LD_PRELOAD cannot be preloaded (cannot open shared object file): ignored.
ERROR: ld.so: object 'lib64/libuid_wrapper.so' from LD_PRELOAD cannot be preloaded (cannot open shared object file): ignored.
OK: SSH-2.0-OpenSSH_8.3
[ RUN      ] torture_ssh_forward
Could not run test: rc < 0, errno(1): Operation not permitted
[   LINE   ] --- /home/tkloczko/rpmbuild/BUILD/libssh-0.9.5/tests/client/torture_forward.c:56: error: Failure!Test setup failed
[  ERROR   ] torture_ssh_forward
[==========] 1 test(s) run.
[  PASSED  ] 0 test(s).

      Start 41: torture_knownhosts
41/57 Test #41: torture_knownhosts ...............***Failed    0.12 sec
ERROR: ld.so: object 'lib64/libuid_wrapper.so' from LD_PRELOAD cannot be preloaded (cannot open shared object file): ignored.
[==========] Running 8 test(s).
ERROR: ld.so: object 'lib64/libuid_wrapper.so' from LD_PRELOAD cannot be preloaded (cannot open shared object file): ignored.
PWRAP_ERROR[<unknown> (87877)] - pwrap_clean_stale_dirs: Failed to parse pid, buf=87864
PWRAP_ERROR[<unknown> (87877)] - pwrap_clean_stale_dirs: Failed to parse pid, buf=79404
PWRAP_ERROR[<unknown> (87877)] - pwrap_clean_stale_dirs: Failed to parse pid, buf=79339
PWRAP_ERROR[<unknown> (87877)] - pwrap_clean_stale_dirs: Failed to parse pid, buf=87871
ERROR: ld.so: object 'lib64/libuid_wrapper.so' from LD_PRELOAD cannot be preloaded (cannot open shared object file): ignored.
ERROR: ld.so: object 'lib64/libuid_wrapper.so' from LD_PRELOAD cannot be preloaded (cannot open shared object file): ignored.
OK: SSH-2.0-OpenSSH_8.3
[ RUN      ] torture_knownhosts_wildcard
Could not run test: rc < 0, errno(1): Operation not permitted
[   LINE   ] --- /home/tkloczko/rpmbuild/BUILD/libssh-0.9.5/tests/client/torture_knownhosts.c:72: error: Failure!Test setup failed
[  ERROR   ] torture_knownhosts_wildcard
[ RUN      ] torture_knownhosts_standard_port
Could not run test: rc < 0, errno(1): Operation not permitted
[   LINE   ] --- /home/tkloczko/rpmbuild/BUILD/libssh-0.9.5/tests/client/torture_knownhosts.c:72: error: Failure!Test setup failed
[  ERROR   ] torture_knownhosts_standard_port
[ RUN      ] torture_knownhosts_port
Could not run test: rc < 0, errno(1): Operation not permitted
[   LINE   ] --- /home/tkloczko/rpmbuild/BUILD/libssh-0.9.5/tests/client/torture_knownhosts.c:72: error: Failure!Test setup failed
[  ERROR   ] torture_knownhosts_port
[ RUN      ] torture_knownhosts_fail
Could not run test: rc < 0, errno(1): Operation not permitted
[   LINE   ] --- /home/tkloczko/rpmbuild/BUILD/libssh-0.9.5/tests/client/torture_knownhosts.c:72: error: Failure!Test setup failed
[  ERROR   ] torture_knownhosts_fail
[ RUN      ] torture_knownhosts_other
Could not run test: rc < 0, errno(1): Operation not permitted
[   LINE   ] --- /home/tkloczko/rpmbuild/BUILD/libssh-0.9.5/tests/client/torture_knownhosts.c:72: error: Failure!Test setup failed
[  ERROR   ] torture_knownhosts_other
[ RUN      ] torture_knownhosts_other_auto
Could not run test: rc < 0, errno(1): Operation not permitted
[   LINE   ] --- /home/tkloczko/rpmbuild/BUILD/libssh-0.9.5/tests/client/torture_knownhosts.c:72: error: Failure!Test setup failed
[  ERROR   ] torture_knownhosts_other_auto
[ RUN      ] torture_knownhosts_conflict
Could not run test: rc < 0, errno(1): Operation not permitted
[   LINE   ] --- /home/tkloczko/rpmbuild/BUILD/libssh-0.9.5/tests/client/torture_knownhosts.c:72: error: Failure!Test setup failed
[  ERROR   ] torture_knownhosts_conflict
[ RUN      ] torture_knownhosts_no_hostkeychecking
Could not run test: rc < 0, errno(1): Operation not permitted
[   LINE   ] --- /home/tkloczko/rpmbuild/BUILD/libssh-0.9.5/tests/client/torture_knownhosts.c:72: error: Failure!Test setup failed
[  ERROR   ] torture_knownhosts_no_hostkeychecking
[==========] 8 test(s) run.
[  PASSED  ] 0 test(s).

      Start 42: torture_knownhosts_verify
42/57 Test #42: torture_knownhosts_verify ........***Failed    0.12 sec
ERROR: ld.so: object 'lib64/libuid_wrapper.so' from LD_PRELOAD cannot be preloaded (cannot open shared object file): ignored.
[==========] Running 8 test(s).
ERROR: ld.so: object 'lib64/libuid_wrapper.so' from LD_PRELOAD cannot be preloaded (cannot open shared object file): ignored.
PWRAP_ERROR[<unknown> (87884)] - pwrap_clean_stale_dirs: Failed to parse pid, buf=79413
PWRAP_ERROR[<unknown> (87884)] - pwrap_clean_stale_dirs: Failed to parse pid, buf=87878
PWRAP_ERROR[<unknown> (87884)] - pwrap_clean_stale_dirs: Failed to parse pid, buf=79346
PWRAP_ERROR[<unknown> (87884)] - pwrap_clean_stale_dirs: Failed to parse pid, buf=87816
ERROR: ld.so: object 'lib64/libuid_wrapper.so' from LD_PRELOAD cannot be preloaded (cannot open shared object file): ignored.
ERROR: ld.so: object 'lib64/libuid_wrapper.so' from LD_PRELOAD cannot be preloaded (cannot open shared object file): ignored.
OK: SSH-2.0-OpenSSH_8.3
[ RUN      ] torture_knownhosts_export
Could not run test: rc < 0, errno(1): Operation not permitted
[   LINE   ] --- /home/tkloczko/rpmbuild/BUILD/libssh-0.9.5/tests/client/torture_knownhosts_verify.c:72: error: Failure!Test setup failed
[  ERROR   ] torture_knownhosts_export
[ RUN      ] torture_knownhosts_write_and_verify
Could not run test: rc < 0, errno(1): Operation not permitted
[   LINE   ] --- /home/tkloczko/rpmbuild/BUILD/libssh-0.9.5/tests/client/torture_knownhosts_verify.c:72: error: Failure!Test setup failed
[  ERROR   ] torture_knownhosts_write_and_verify
[ RUN      ] torture_knownhosts_precheck
Could not run test: rc < 0, errno(1): Operation not permitted
[   LINE   ] --- /home/tkloczko/rpmbuild/BUILD/libssh-0.9.5/tests/client/torture_knownhosts_verify.c:72: error: Failure!Test setup failed
[  ERROR   ] torture_knownhosts_precheck
[ RUN      ] torture_knownhosts_other
Could not run test: rc < 0, errno(1): Operation not permitted
[   LINE   ] --- /home/tkloczko/rpmbuild/BUILD/libssh-0.9.5/tests/client/torture_knownhosts_verify.c:72: error: Failure!Test setup failed
[  ERROR   ] torture_knownhosts_other
[ RUN      ] torture_knownhosts_unknown
Could not run test: rc < 0, errno(1): Operation not permitted
[   LINE   ] --- /home/tkloczko/rpmbuild/BUILD/libssh-0.9.5/tests/client/torture_knownhosts_verify.c:72: error: Failure!Test setup failed
[  ERROR   ] torture_knownhosts_unknown
[ RUN      ] torture_knownhosts_conflict
Could not run test: rc < 0, errno(1): Operation not permitted
[   LINE   ] --- /home/tkloczko/rpmbuild/BUILD/libssh-0.9.5/tests/client/torture_knownhosts_verify.c:72: error: Failure!Test setup failed
[  ERROR   ] torture_knownhosts_conflict
[ RUN      ] torture_knownhosts_duplicate
Could not run test: rc < 0, errno(1): Operation not permitted
[   LINE   ] --- /home/tkloczko/rpmbuild/BUILD/libssh-0.9.5/tests/client/torture_knownhosts_verify.c:72: error: Failure!Test setup failed
[  ERROR   ] torture_knownhosts_duplicate
[ RUN      ] torture_knownhosts_new_file
Could not run test: rc < 0, errno(1): Operation not permitted
[   LINE   ] --- /home/tkloczko/rpmbuild/BUILD/libssh-0.9.5/tests/client/torture_knownhosts_verify.c:72: error: Failure!Test setup failed
[  ERROR   ] torture_knownhosts_new_file
[==========] 8 test(s) run.
[  PASSED  ] 0 test(s).

      Start 43: torture_proxycommand
43/57 Test #43: torture_proxycommand .............***Failed    0.12 sec
ERROR: ld.so: object 'lib64/libuid_wrapper.so' from LD_PRELOAD cannot be preloaded (cannot open shared object file): ignored.
[==========] Running 4 test(s).
ERROR: ld.so: object 'lib64/libuid_wrapper.so' from LD_PRELOAD cannot be preloaded (cannot open shared object file): ignored.
PWRAP_ERROR[<unknown> (87891)] - pwrap_clean_stale_dirs: Failed to parse pid, buf=79420
PWRAP_ERROR[<unknown> (87891)] - pwrap_clean_stale_dirs: Failed to parse pid, buf=87885
PWRAP_ERROR[<unknown> (87891)] - pwrap_clean_stale_dirs: Failed to parse pid, buf=79353
ERROR: ld.so: object 'lib64/libuid_wrapper.so' from LD_PRELOAD cannot be preloaded (cannot open shared object file): ignored.
ERROR: ld.so: object 'lib64/libuid_wrapper.so' from LD_PRELOAD cannot be preloaded (cannot open shared object file): ignored.
OK: SSH-2.0-OpenSSH_8.3
[ RUN      ] torture_options_set_proxycommand
Could not run test: rc < 0, errno(1): Operation not permitted
[   LINE   ] --- /home/tkloczko/rpmbuild/BUILD/libssh-0.9.5/tests/client/torture_proxycommand.c:39: error: Failure!Test setup failed
[  ERROR   ] torture_options_set_proxycommand
[ RUN      ] torture_options_set_proxycommand_notexist
Could not run test: rc < 0, errno(1): Operation not permitted
[   LINE   ] --- /home/tkloczko/rpmbuild/BUILD/libssh-0.9.5/tests/client/torture_proxycommand.c:39: error: Failure!Test setup failed
[  ERROR   ] torture_options_set_proxycommand_notexist
[ RUN      ] torture_options_set_proxycommand_ssh
Could not run test: rc < 0, errno(1): Operation not permitted
[   LINE   ] --- /home/tkloczko/rpmbuild/BUILD/libssh-0.9.5/tests/client/torture_proxycommand.c:39: error: Failure!Test setup failed
[  ERROR   ] torture_options_set_proxycommand_ssh
[ RUN      ] torture_options_set_proxycommand_ssh_stderr
Could not run test: rc < 0, errno(1): Operation not permitted
[   LINE   ] --- /home/tkloczko/rpmbuild/BUILD/libssh-0.9.5/tests/client/torture_proxycommand.c:39: error: Failure!Test setup failed
[  ERROR   ] torture_options_set_proxycommand_ssh_stderr
[==========] 4 test(s) run.
[  PASSED  ] 0 test(s).

      Start 44: torture_session
44/57 Test #44: torture_session ..................***Failed    0.12 sec
ERROR: ld.so: object 'lib64/libuid_wrapper.so' from LD_PRELOAD cannot be preloaded (cannot open shared object file): ignored.
[==========] Running 1 test(s).
ERROR: ld.so: object 'lib64/libuid_wrapper.so' from LD_PRELOAD cannot be preloaded (cannot open shared object file): ignored.
PWRAP_ERROR[<unknown> (87898)] - pwrap_clean_stale_dirs: Failed to parse pid, buf=79353
ERROR: ld.so: object 'lib64/libuid_wrapper.so' from LD_PRELOAD cannot be preloaded (cannot open shared object file): ignored.
ERROR: ld.so: object 'lib64/libuid_wrapper.so' from LD_PRELOAD cannot be preloaded (cannot open shared object file): ignored.
OK: SSH-2.0-OpenSSH_8.3
[ RUN      ] torture_channel_read_error
Could not run test: rc < 0, errno(1): Operation not permitted
[   LINE   ] --- /home/tkloczko/rpmbuild/BUILD/libssh-0.9.5/tests/client/torture_session.c:61: error: Failure!Test setup failed
[  ERROR   ] torture_channel_read_error
[==========] 1 test(s) run.
[  PASSED  ] 0 test(s).

      Start 45: torture_request_env
45/57 Test #45: torture_request_env ..............***Failed    0.13 sec
ERROR: ld.so: object 'lib64/libuid_wrapper.so' from LD_PRELOAD cannot be preloaded (cannot open shared object file): ignored.
[==========] Running 1 test(s).
ERROR: ld.so: object 'lib64/libuid_wrapper.so' from LD_PRELOAD cannot be preloaded (cannot open shared object file): ignored.
PWRAP_ERROR[<unknown> (87905)] - pwrap_clean_stale_dirs: Failed to parse pid, buf=79427
PWRAP_ERROR[<unknown> (87905)] - pwrap_clean_stale_dirs: Failed to parse pid, buf=79367
PWRAP_ERROR[<unknown> (87905)] - pwrap_clean_stale_dirs: Failed to parse pid, buf=87892
PWRAP_ERROR[<unknown> (87905)] - pwrap_clean_stale_dirs: Failed to parse pid, buf=79434
PWRAP_ERROR[<unknown> (87905)] - pwrap_clean_stale_dirs: Failed to parse pid, buf=87899
PWRAP_ERROR[<unknown> (87905)] - pwrap_clean_stale_dirs: Failed to parse pid, buf=87771
PWRAP_ERROR[<unknown> (87905)] - pwrap_clean_stale_dirs: Failed to parse pid, buf=79374
ERROR: ld.so: object 'lib64/libuid_wrapper.so' from LD_PRELOAD cannot be preloaded (cannot open shared object file): ignored.
ERROR: ld.so: object 'lib64/libuid_wrapper.so' from LD_PRELOAD cannot be preloaded (cannot open shared object file): ignored.
OK: SSH-2.0-OpenSSH_8.3
[ RUN      ] torture_request_env
Could not run test: rc < 0, errno(1): Operation not permitted
[   LINE   ] --- /home/tkloczko/rpmbuild/BUILD/libssh-0.9.5/tests/client/torture_request_env.c:56: error: Failure!Test setup failed
[  ERROR   ] torture_request_env
[==========] 1 test(s) run.
[  PASSED  ] 0 test(s).

      Start 46: torture_client_global_requests
46/57 Test #46: torture_client_global_requests ...***Failed    0.13 sec
ERROR: ld.so: object 'lib64/libuid_wrapper.so' from LD_PRELOAD cannot be preloaded (cannot open shared object file): ignored.
[==========] Running 1 test(s).
ERROR: ld.so: object 'lib64/libuid_wrapper.so' from LD_PRELOAD cannot be preloaded (cannot open shared object file): ignored.
PWRAP_ERROR[<unknown> (87912)] - pwrap_clean_stale_dirs: Failed to parse pid, buf=87771
PWRAP_ERROR[<unknown> (87912)] - pwrap_clean_stale_dirs: Failed to parse pid, buf=79374
ERROR: ld.so: object 'lib64/libuid_wrapper.so' from LD_PRELOAD cannot be preloaded (cannot open shared object file): ignored.
ERROR: ld.so: object 'lib64/libuid_wrapper.so' from LD_PRELOAD cannot be preloaded (cannot open shared object file): ignored.
OK: SSH-2.0-OpenSSH_8.3
[ RUN      ] torture_unknown_request
Could not run test: rc < 0, errno(1): Operation not permitted
[   LINE   ] --- /home/tkloczko/rpmbuild/BUILD/libssh-0.9.5/tests/client/torture_client_global_requests.c:66: error: Failure!Test setup failed
[  ERROR   ] torture_unknown_request
[==========] 1 test(s) run.
[  PASSED  ] 0 test(s).

      Start 47: torture_scp
47/57 Test #47: torture_scp ......................***Failed    0.12 sec
ERROR: ld.so: object 'lib64/libuid_wrapper.so' from LD_PRELOAD cannot be preloaded (cannot open shared object file): ignored.
[==========] Running 6 test(s).
ERROR: ld.so: object 'lib64/libuid_wrapper.so' from LD_PRELOAD cannot be preloaded (cannot open shared object file): ignored.
ERROR: ld.so: object 'lib64/libuid_wrapper.so' from LD_PRELOAD cannot be preloaded (cannot open shared object file): ignored.
ERROR: ld.so: object 'lib64/libuid_wrapper.so' from LD_PRELOAD cannot be preloaded (cannot open shared object file): ignored.
OK: SSH-2.0-OpenSSH_8.3
[ RUN      ] torture_scp_upload
Could not run test: rc < 0, errno(1): Operation not permitted
[   LINE   ] --- /home/tkloczko/rpmbuild/BUILD/libssh-0.9.5/tests/client/torture_scp.c:115: error: Failure!Test setup failed
[  ERROR   ] torture_scp_upload
[ RUN      ] torture_scp_upload_recursive
Could not run test: rc < 0, errno(1): Operation not permitted
[   LINE   ] --- /home/tkloczko/rpmbuild/BUILD/libssh-0.9.5/tests/client/torture_scp.c:115: error: Failure!Test setup failed
[  ERROR   ] torture_scp_upload_recursive
[ RUN      ] torture_scp_download
Could not run test: rc < 0, errno(1): Operation not permitted
[   LINE   ] --- /home/tkloczko/rpmbuild/BUILD/libssh-0.9.5/tests/client/torture_scp.c:115: error: Failure!Test setup failed
[  ERROR   ] torture_scp_download
[ RUN      ] torture_scp_download_recursive
Could not run test: rc < 0, errno(1): Operation not permitted
[   LINE   ] --- /home/tkloczko/rpmbuild/BUILD/libssh-0.9.5/tests/client/torture_scp.c:115: error: Failure!Test setup failed
[  ERROR   ] torture_scp_download_recursive
[ RUN      ] torture_scp_upload_newline
Could not run test: rc < 0, errno(1): Operation not permitted
[   LINE   ] --- /home/tkloczko/rpmbuild/BUILD/libssh-0.9.5/tests/client/torture_scp.c:115: error: Failure!Test setup failed
[  ERROR   ] torture_scp_upload_newline
[ RUN      ] torture_scp_upload_appended_command
Could not run test: rc < 0, errno(1): Operation not permitted
[   LINE   ] --- /home/tkloczko/rpmbuild/BUILD/libssh-0.9.5/tests/client/torture_scp.c:115: error: Failure!Test setup failed
[  ERROR   ] torture_scp_upload_appended_command
[==========] 6 test(s) run.
[  PASSED  ] 0 test(s).

      Start 48: torture_sftp_ext
48/57 Test #48: torture_sftp_ext .................   Passed    0.01 sec
      Start 49: torture_sftp_canonicalize_path
49/57 Test #49: torture_sftp_canonicalize_path ...***Failed    0.12 sec
ERROR: ld.so: object 'lib64/libuid_wrapper.so' from LD_PRELOAD cannot be preloaded (cannot open shared object file): ignored.
[==========] Running 1 test(s).
ERROR: ld.so: object 'lib64/libuid_wrapper.so' from LD_PRELOAD cannot be preloaded (cannot open shared object file): ignored.
PWRAP_ERROR[<unknown> (87927)] - pwrap_clean_stale_dirs: Failed to parse pid, buf=87857
PWRAP_ERROR[<unknown> (87927)] - pwrap_clean_stale_dirs: Failed to parse pid, buf=79318
PWRAP_ERROR[<unknown> (87927)] - pwrap_clean_stale_dirs: Failed to parse pid, buf=87718
PWRAP_ERROR[<unknown> (87927)] - pwrap_clean_stale_dirs: Failed to parse pid, buf=79390
PWRAP_ERROR[<unknown> (87927)] - pwrap_clean_stale_dirs: Failed to parse pid, buf=79325
ERROR: ld.so: object 'lib64/libuid_wrapper.so' from LD_PRELOAD cannot be preloaded (cannot open shared object file): ignored.
ERROR: ld.so: object 'lib64/libuid_wrapper.so' from LD_PRELOAD cannot be preloaded (cannot open shared object file): ignored.
OK: SSH-2.0-OpenSSH_8.3
[ RUN      ] torture_sftp_canonicalize_path
Could not run test: rc < 0, errno(1): Operation not permitted
[   LINE   ] --- /home/tkloczko/rpmbuild/BUILD/libssh-0.9.5/tests/client/torture_sftp_canonicalize_path.c:35: error: Failure!Test setup failed
[  ERROR   ] torture_sftp_canonicalize_path
[==========] 1 test(s) run.
[  PASSED  ] 0 test(s).

      Start 50: torture_sftp_dir
50/57 Test #50: torture_sftp_dir .................***Failed    0.13 sec
ERROR: ld.so: object 'lib64/libuid_wrapper.so' from LD_PRELOAD cannot be preloaded (cannot open shared object file): ignored.
[==========] Running 1 test(s).
ERROR: ld.so: object 'lib64/libuid_wrapper.so' from LD_PRELOAD cannot be preloaded (cannot open shared object file): ignored.
PWRAP_ERROR[<unknown> (87934)] - pwrap_clean_stale_dirs: Failed to parse pid, buf=79390
PWRAP_ERROR[<unknown> (87934)] - pwrap_clean_stale_dirs: Failed to parse pid, buf=79325
ERROR: ld.so: object 'lib64/libuid_wrapper.so' from LD_PRELOAD cannot be preloaded (cannot open shared object file): ignored.
ERROR: ld.so: object 'lib64/libuid_wrapper.so' from LD_PRELOAD cannot be preloaded (cannot open shared object file): ignored.
OK: SSH-2.0-OpenSSH_8.3
[ RUN      ] torture_sftp_mkdir
Could not run test: rc < 0, errno(1): Operation not permitted
[   LINE   ] --- /home/tkloczko/rpmbuild/BUILD/libssh-0.9.5/tests/client/torture_sftp_dir.c:35: error: Failure!Test setup failed
[  ERROR   ] torture_sftp_mkdir
[==========] 1 test(s) run.
[  PASSED  ] 0 test(s).

      Start 51: torture_sftp_read
51/57 Test #51: torture_sftp_read ................***Failed    0.12 sec
ERROR: ld.so: object 'lib64/libuid_wrapper.so' from LD_PRELOAD cannot be preloaded (cannot open shared object file): ignored.
[==========] Running 2 test(s).
ERROR: ld.so: object 'lib64/libuid_wrapper.so' from LD_PRELOAD cannot be preloaded (cannot open shared object file): ignored.
ERROR: ld.so: object 'lib64/libuid_wrapper.so' from LD_PRELOAD cannot be preloaded (cannot open shared object file): ignored.
ERROR: ld.so: object 'lib64/libuid_wrapper.so' from LD_PRELOAD cannot be preloaded (cannot open shared object file): ignored.
OK: SSH-2.0-OpenSSH_8.3
[ RUN      ] torture_sftp_read_blocking
Could not run test: rc < 0, errno(1): Operation not permitted
[   LINE   ] --- /home/tkloczko/rpmbuild/BUILD/libssh-0.9.5/tests/client/torture_sftp_read.c:37: error: Failure!Test setup failed
[  ERROR   ] torture_sftp_read_blocking
[ RUN      ] torture_sftp_read_blocking
Could not run test: rc < 0, errno(1): Operation not permitted
[   LINE   ] --- /home/tkloczko/rpmbuild/BUILD/libssh-0.9.5/tests/client/torture_sftp_read.c:37: error: Failure!Test setup failed
[  ERROR   ] torture_sftp_read_blocking
[==========] 2 test(s) run.
[  PASSED  ] 0 test(s).

      Start 52: torture_sftp_fsync
52/57 Test #52: torture_sftp_fsync ...............***Failed    0.12 sec
ERROR: ld.so: object 'lib64/libuid_wrapper.so' from LD_PRELOAD cannot be preloaded (cannot open shared object file): ignored.
[==========] Running 1 test(s).
ERROR: ld.so: object 'lib64/libuid_wrapper.so' from LD_PRELOAD cannot be preloaded (cannot open shared object file): ignored.
PWRAP_ERROR[<unknown> (87949)] - pwrap_clean_stale_dirs: Failed to parse pid, buf=79339
PWRAP_ERROR[<unknown> (87949)] - pwrap_clean_stale_dirs: Failed to parse pid, buf=87871
PWRAP_ERROR[<unknown> (87949)] - pwrap_clean_stale_dirs: Failed to parse pid, buf=87928
PWRAP_ERROR[<unknown> (87949)] - pwrap_clean_stale_dirs: Failed to parse pid, buf=79413
PWRAP_ERROR[<unknown> (87949)] - pwrap_clean_stale_dirs: Failed to parse pid, buf=87878
PWRAP_ERROR[<unknown> (87949)] - pwrap_clean_stale_dirs: Failed to parse pid, buf=79346
PWRAP_ERROR[<unknown> (87949)] - pwrap_clean_stale_dirs: Failed to parse pid, buf=87816
PWRAP_ERROR[<unknown> (87949)] - pwrap_clean_stale_dirs: Failed to parse pid, buf=87935
PWRAP_ERROR[<unknown> (87949)] - pwrap_clean_stale_dirs: Failed to parse pid, buf=79420
PWRAP_ERROR[<unknown> (87949)] - pwrap_clean_stale_dirs: Failed to parse pid, buf=87885
PWRAP_ERROR[<unknown> (87949)] - pwrap_clean_stale_dirs: Failed to parse pid, buf=79353
PWRAP_ERROR[<unknown> (87949)] - pwrap_clean_stale_dirs: Failed to parse pid, buf=87943
PWRAP_ERROR[<unknown> (87949)] - pwrap_clean_stale_dirs: Failed to parse pid, buf=79360
PWRAP_ERROR[<unknown> (87949)] - pwrap_clean_stale_dirs: Failed to parse pid, buf=79427
PWRAP_ERROR[<unknown> (87949)] - pwrap_clean_stale_dirs: Failed to parse pid, buf=79367
PWRAP_ERROR[<unknown> (87949)] - pwrap_clean_stale_dirs: Failed to parse pid, buf=87892
PWRAP_ERROR[<unknown> (87949)] - pwrap_clean_stale_dirs: Failed to parse pid, buf=79434
PWRAP_ERROR[<unknown> (87949)] - pwrap_clean_stale_dirs: Failed to parse pid, buf=87899
PWRAP_ERROR[<unknown> (87949)] - pwrap_clean_stale_dirs: Failed to parse pid, buf=87771
PWRAP_ERROR[<unknown> (87949)] - pwrap_clean_stale_dirs: Failed to parse pid, buf=79374
ERROR: ld.so: object 'lib64/libuid_wrapper.so' from LD_PRELOAD cannot be preloaded (cannot open shared object file): ignored.
ERROR: ld.so: object 'lib64/libuid_wrapper.so' from LD_PRELOAD cannot be preloaded (cannot open shared object file): ignored.
OK: SSH-2.0-OpenSSH_8.3
[ RUN      ] torture_sftp_fsync
Could not run test: rc < 0, errno(1): Operation not permitted
[   LINE   ] --- /home/tkloczko/rpmbuild/BUILD/libssh-0.9.5/tests/client/torture_sftp_fsync.c:37: error: Failure!Test setup failed
[  ERROR   ] torture_sftp_fsync
[==========] 1 test(s) run.
[  PASSED  ] 0 test(s).

      Start 53: pkd_hello_i1
53/57 Test #53: pkd_hello_i1 .....................   Passed   54.41 sec
      Start 54: pkd_hello_rekey
54/57 Test #54: pkd_hello_rekey ..................   Passed    1.67 sec
      Start 55: torture_server
55/57 Test #55: torture_server ...................***Failed    0.22 sec
ERROR: ld.so: object 'lib64/libuid_wrapper.so' from LD_PRELOAD cannot be preloaded (cannot open shared object file): ignored.
[==========] Running 5 test(s).
[ RUN      ] torture_server_auth_none
Could not run test: rc < 0, errno(1): Operation not permitted
[   LINE   ] --- /home/tkloczko/rpmbuild/BUILD/libssh-0.9.5/tests/server/torture_server.c:283: error: Failure!Test setup failed
[  ERROR   ] torture_server_auth_none
[ RUN      ] torture_server_auth_password
Could not run test: rc < 0, errno(1): Operation not permitted
[   LINE   ] --- /home/tkloczko/rpmbuild/BUILD/libssh-0.9.5/tests/server/torture_server.c:283: error: Failure!Test setup failed
[  ERROR   ] torture_server_auth_password
[ RUN      ] torture_server_auth_pubkey
Could not run test: rc < 0, errno(1): Operation not permitted
[   LINE   ] --- /home/tkloczko/rpmbuild/BUILD/libssh-0.9.5/tests/server/torture_server.c:283: error: Failure!Test setup failed
[  ERROR   ] torture_server_auth_pubkey
[ RUN      ] torture_server_hostkey_mismatch
Could not run test: rc < 0, errno(1): Operation not permitted
[   LINE   ] --- /home/tkloczko/rpmbuild/BUILD/libssh-0.9.5/tests/server/torture_server.c:283: error: Failure!Test setup failed
[  ERROR   ] torture_server_hostkey_mismatch
[ RUN      ] torture_server_unknown_global_request
Could not run test: rc < 0, errno(1): Operation not permitted
[   LINE   ] --- /home/tkloczko/rpmbuild/BUILD/libssh-0.9.5/tests/server/torture_server.c:283: error: Failure!Test setup failed
[  ERROR   ] torture_server_unknown_global_request
[==========] 5 test(s) run.
[  PASSED  ] 0 test(s).

      Start 56: torture_server_auth_kbdint
56/57 Test #56: torture_server_auth_kbdint .......***Failed    0.22 sec
ERROR: ld.so: object 'lib64/libuid_wrapper.so' from LD_PRELOAD cannot be preloaded (cannot open shared object file): ignored.
[==========] Running 1 test(s).
[ RUN      ] torture_server_auth_kbdint
Could not run test: rc < 0, errno(1): Operation not permitted
[   LINE   ] --- /home/tkloczko/rpmbuild/BUILD/libssh-0.9.5/tests/server/torture_server_auth_kbdint.c:654: error: Failure!Test setup failed
[  ERROR   ] torture_server_auth_kbdint
[==========] 1 test(s) run.
[  PASSED  ] 0 test(s).

      Start 57: torture_server_config
57/57 Test #57: torture_server_config ............***Timeout 1500.10 sec
ERROR: ld.so: object 'lib64/libuid_wrapper.so' from LD_PRELOAD cannot be preloaded (cannot open shared object file): ignored.
[==========] Running 6 test(s).
[ RUN      ] torture_server_config_hostkey
Trying content:

HostKey /tmp/test_socket_wrapper_Btx4nE/sshd/ssh_host_rsa_key

[  ERROR   ] --- rc < 0, errno(1): Operation not permitted
[   LINE   ] --- /home/tkloczko/rpmbuild/BUILD/libssh-0.9.5/tests/server/torture_server_config.c:318: error: Failure!
[  FAILED  ] torture_server_config_hostkey
[ RUN      ] torture_server_config_ciphers
Trying content:

HostKey /tmp/test_socket_wrapper_Btx4nE/sshd/ssh_host_rsa_key
Ciphers aes256-gcm@openssh.com,aes128-gcm@openssh.com,aes256-ctr,aes192-ctr,aes128-ctr,aes256-cbc,aes192-cbc,aes128-cbc,3des-cbc

[  ERROR   ] --- rc < 0, errno(1): Operation not permitted
[   LINE   ] --- /home/tkloczko/rpmbuild/BUILD/libssh-0.9.5/tests/server/torture_server_config.c:318: error: Failure!
[  FAILED  ] torture_server_config_ciphers
[ RUN      ] torture_server_config_macs
Trying content:

HostKey /tmp/test_socket_wrapper_Btx4nE/sshd/ssh_host_rsa_key
MACs hmac-sha2-256-etm@openssh.com,hmac-sha2-512-etm@openssh.com,hmac-sha1-etm@openssh.com,hmac-sha2-256,hmac-sha2-512,hmac-sha1

[  ERROR   ] --- rc < 0, errno(1): Operation not permitted
[   LINE   ] --- /home/tkloczko/rpmbuild/BUILD/libssh-0.9.5/tests/server/torture_server_config.c:318: error: Failure!
[  FAILED  ] torture_server_config_macs
[ RUN      ] torture_server_config_kex
Trying content:

HostKey /tmp/test_socket_wrapper_Btx4nE/sshd/ssh_host_rsa_key
KexAlgorithms curve25519-sha256,curve25519-sha256@libssh.org,ecdh-sha2-nistp256,ecdh-sha2-nistp384,ecdh-sha2-nistp521,diffie-hellman-group18-sha512,diffie-hellman-group16-sha512,diffie-hellman-group-exchange-sha256,diffie-hellman-group14-sha256,diffie-hellman-group14-sha1,diffie-hellman-group1-sha1

[  ERROR   ] --- rc < 0, errno(1): Operation not permitted
[   LINE   ] --- /home/tkloczko/rpmbuild/BUILD/libssh-0.9.5/tests/server/torture_server_config.c:318: error: Failure!
[  FAILED  ] torture_server_config_kex
[ RUN      ] torture_server_config_hostkey_algorithms
Trying content:

HostKey /tmp/test_socket_wrapper_Btx4nE/sshd/ssh_host_rsa_key
HostKeyAlgorithms ssh-ed25519-cert-v01@openssh.com,ecdsa-sha2-nistp521-cert-v01@openssh.com,ecdsa-sha2-nistp384-cert-v01@openssh.com,ecdsa-sha2-nistp256-cert-v01@openssh.com,rsa-sha2-512-cert-v01@openssh.com,rsa-sha2-256-cert-v01@openssh.com,ssh-rsa-cert-v01@openssh.com,ssh-dss-cert-v01@openssh.com,ssh-ed25519,ecdsa-sha2-nistp521,ecdsa-sha2-nistp384,ecdsa-sha2-nistp256,rsa-sha2-512,rsa-sha2-256,ssh-rsa,ssh-dss

[  ERROR   ] --- rc < 0, errno(1): Operation not permitted
[   LINE   ] --- /home/tkloczko/rpmbuild/BUILD/libssh-0.9.5/tests/server/torture_server_config.c:318: error: Failure!
[  FAILED  ] torture_server_config_hostkey_algorithms
[ RUN      ] torture_server_config_unknown
Trying content:

HostKey /tmp/test_socket_wrapper_Btx4nE/sshd/ssh_host_rsa_key
UnknownOption unknown-value1,unknown-value2

[  ERROR   ] --- rc < 0, errno(1): Operation not permitted
[   LINE   ] --- /home/tkloczko/rpmbuild/BUILD/libssh-0.9.5/tests/server/torture_server_config.c:318: error: Failure!
[  FAILED  ] torture_server_config_unknown
[==========] 6 test(s) run.
[  PASSED  ] 0 test(s).
[  FAILED  ] 6 test(s), listed below:
[  FAILED  ] torture_server_config_hostkey
[  FAILED  ] torture_server_config_ciphers
[  FAILED  ] torture_server_config_macs
[  FAILED  ] torture_server_config_kex
[  FAILED  ] torture_server_config_hostkey_algorithms
[  FAILED  ] torture_server_config_unknown

 6 FAILED TEST(S)


63% tests passed, 21 tests failed out of 57

Total Test time (real) = 1579.43 sec

The following tests FAILED:
         34 - torture_algorithms (Failed)
         35 - torture_client_config (Failed)
         36 - torture_connect (Failed)
         37 - torture_hostkey (Failed)
         38 - torture_auth (Failed)
         39 - torture_rekey (Failed)
         40 - torture_forward (Failed)
         41 - torture_knownhosts (Failed)
         42 - torture_knownhosts_verify (Failed)
         43 - torture_proxycommand (Failed)
         44 - torture_session (Failed)
         45 - torture_request_env (Failed)
         46 - torture_client_global_requests (Failed)
         47 - torture_scp (Failed)
         49 - torture_sftp_canonicalize_path (Failed)
         50 - torture_sftp_dir (Failed)
         51 - torture_sftp_read (Failed)
         52 - torture_sftp_fsync (Failed)
         55 - torture_server (Failed)
         56 - torture_server_auth_kbdint (Failed)
         57 - torture_server_config (Timeout)
Errors while running CTest
make: *** [Makefile:129: test] Error 8
make: Leaving directory '/home/tkloczko/rpmbuild/BUILD/libssh-0.9.5/x86_64-redhat-linux-gnu'

Event Timeline

kloczek triaged this task as Normal priority.Sep 25 2020, 7:11 AM
kloczek created this task.

Just iun case .. I have installed uid_wrapper

]$ rpm -ql uid_wrapper
/usr/lib/.build-id
/usr/lib/.build-id/de
/usr/lib/.build-id/de/92a25d0d0241dee4c96f47ebc0ec9b76c8154a
/usr/lib64/cmake/uid_wrapper
/usr/lib64/cmake/uid_wrapper/uid_wrapper-config-version.cmake
/usr/lib64/cmake/uid_wrapper/uid_wrapper-config.cmake
/usr/lib64/libuid_wrapper.so
/usr/lib64/libuid_wrapper.so.0
/usr/lib64/libuid_wrapper.so.0.0.8
/usr/lib64/pkgconfig/uid_wrapper.pc
/usr/share/man/man1/uid_wrapper.1.gz
Jakuje added a subscriber: Jakuje.Sep 25 2020, 9:29 AM

Is your user somehow restricted (for example by SELinux)? Do you have some AVC errors? Does it work with SELinux in permissive?

Yes I have enabled SELinux.

$ sestatus
SELinux status:                 enabled
SELinuxfs mount:                /sys/fs/selinux
SELinux root directory:         /etc/selinux
Loaded policy name:             targeted
Current mode:                   enforcing
Mode from config file:          enforcing
Policy MLS status:              enabled
Policy deny_unknown status:     allowed
Memory protection checking:     actual (secure)
Max kernel policy version:      33

Do you have some AVC errors? Does it work with SELinux in permissive?

How can I check AVC errors?

AVC errors are logged in journal or in audit.log. ausearch -m AVC is helpfult too.